Target
Aromatic-L-amino-acid decarboxylase
Ligand
BDBM50005742
Substrate
Meas. Tech.
ChEMBL_59433 (CHEMBL872492)
Ki
1000000±n/a nM
Citation
 Ahmad, SPhillips, RSStammer, CH Inhibition of pig kidney L-aromatic amino acid decarboxylase by 2,3-methano-m-tyrosines. J Med Chem 35:1410-7 (1992)  
Target
Name:
Aromatic-L-amino-acid decarboxylase
Synonyms:
DDC DOPA decarboxylase
Type:
PROTEIN
Mol. Mass.:
53939.21
Organism:
Sus scrofa
Description:
ChEMBL_59433
Residue:
486
  
Inhibitor
Name:
BDBM50005742
Synonyms:
(+)-D-m-Tyrosine2-Amino-3-(3-hydroxy-phenyl)-2-methyl-propionic acid | CHEMBL417317
Type:
Small organic molecule
Emp. Form.:
C10H13NO3
Mol. Mass.:
195.2151
SMILES:
C[C@](N)(Cc1cccc(O)c1)C(O)=O
: