Target
Muscarinic acetylcholine receptor M1
Ligand
BDBM50004665
Substrate
Meas. Tech.
ChEMBL_138959 (CHEMBL742771)
Ki
196±n/a nM
Citation
 Garvey, DSWasicak, JTChung, JYShue, YKCarrera, GMMay, PDMcKinney, MMAnderson, DCadman, EVella-Rountree, L Synthesis and in vitro characterization of novel amino terminally modified oxotremorine derivatives for brain muscarinic receptors. J Med Chem 35:1550-7 (1992)  
Target
Name:
Muscarinic acetylcholine receptor M1
Synonyms:
ACM1_RAT Chrm-1 cholinergic receptor, muscarinic 1
Type:
Enzyme Catalytic Domain
Mol. Mass.:
51390.46
Organism:
RAT
Description:
P08482
Residue:
460
  
Inhibitor
Name:
BDBM50004665
Synonyms:
(oxotremorine)1-(4-Pyrrolidin-1-yl-but-2-ynyl)-pyrrolidin-2-one 1-(4-Pyrrolidin-1-yl-but-2-ynyl)-pyrrolidin-2-one (oxotremorphine) 1-[4-(2-oxo-pyrrolidin-1-yl)-but-2-ynyl]-pyrrolidinium Oxotremorine cid_4630
Type:
Small organic molecule
Emp. Form.:
C12H18N2O
Mol. Mass.:
206.2841
SMILES:
O=C1CCCN1CC#CCN1CCCC1
: