Target
Muscarinic acetylcholine receptor M2
Ligand
BDBM50005855
Substrate
Meas. Tech.
ChEMBL_140188 (CHEMBL744905)
Ki
38100.0±n/a nM
Citation
 Garvey, DSWasicak, JTChung, JYShue, YKCarrera, GMMay, PDMcKinney, MMAnderson, DCadman, EVella-Rountree, L Synthesis and in vitro characterization of novel amino terminally modified oxotremorine derivatives for brain muscarinic receptors. J Med Chem 35:1550-7 (1992)  
Target
Name:
Muscarinic acetylcholine receptor M2
Synonyms:
ACM2_RAT Chrm-2 | Chrm2
Type:
Enzyme Catalytic Domain
Mol. Mass.:
51555.53
Organism:
RAT
Description:
P10980
Residue:
466
  
Inhibitor
Name:
BDBM50005855
Synonyms:
1-(4-Methylamino-but-2-ynyl)-pyrrolidin-2-one | CHEMBL39067
Type:
Small organic molecule
Emp. Form.:
C9H14N2O
Mol. Mass.:
166.2203
SMILES:
CNCC#CCN1CCCC1=O
: