Target
Renin
Ligand
BDBM50006123
Substrate
Meas. Tech.
ChEBML_195926
pH
6±n/a
IC50
1.1±n/a nM
Comments
extracted
Citation
 Martin, SFAustin, REOalmann, CJBaker, WRCondon, SLdeLara, ERosenberg, SHSpina, KPStein, HHCohen, J 1,2,3-trisubstituted cyclopropanes as conformationally restricted peptide isosteres: application to the design and synthesis of novel renin inhibitors. J Med Chem 35:1710-21 (1992)  
Target
Name:
Renin
Synonyms:
Angiotensinogenase RENI_HUMAN
Type:
Enzyme
Mol. Mass.:
45058.99
Organism:
Homo sapiens (Human)
Description:
Residue:
406
  
Inhibitor
Name:
BDBM50006123
Synonyms:
2,3-Diphenyl-cyclopropanecarboxylic acid [1-(1-cyclohexylmethyl-2,3-dihydroxy-5-methyl-hexylcarbamoyl)-2-thiazol-4-yl-ethyl]-amide | CHEMBL296051
Type:
Small organic molecule
Emp. Form.:
C36H47N3O4S
Mol. Mass.:
617.841
SMILES:
CC(C)C[C@H](O)[C@H](O)[C@H](CC1CCCCC1)NC(=O)[C@H](Cc1cscn1)NC(=O)C1[C@@H]([C@@H]1c1ccccc1)c1ccccc1
: