Target
Renin
Ligand
BDBM50006141
Substrate
Meas. Tech.
ChEMBL_195792 (CHEMBL802392)
pH
6±n/a
IC50
3.3±n/a nM
Comments
extracted
Citation
 Baker, WRFung, AKKleinert, HDStein, HHPlattner, JJArmiger, YLCondon, SLCohen, JEgan, DABarlow, JL Nonpeptide renin inhibitors employing a novel 3-aza(or oxa)-2,4-dialkyl glutaric acid moiety as a P2/P3 amide bond replacement. J Med Chem 35:1722-34 (1992)  
Target
Name:
Renin
Synonyms:
Angiotensinogenase RENI_HUMAN
Type:
Enzyme
Mol. Mass.:
45058.99
Organism:
Homo sapiens (Human)
Description:
Residue:
406
  
Inhibitor
Name:
BDBM50006141
Synonyms:
2-[1-Benzyl-2-(4-methoxymethoxy-piperidin-1-yl)-2-oxo-ethoxy]-pentanoic acid (1-cyclohexylmethyl-2,3-dihydroxy-5-methyl-hexyl)-amide | CHEMBL295687
Type:
Small organic molecule
Emp. Form.:
C35H58N2O7
Mol. Mass.:
618.8442
SMILES:
CCC[C@H](O[C@@H](Cc1ccccc1)C(=O)N1CCC(CC1)OCOC)C(=O)N[C@@H](CC1CCCCC1)[C@@H](O)[C@@H](O)CC(C)C
: