Target
Renin
Ligand
BDBM50006156
Substrate
Meas. Tech.
ChEMBL_195794 (CHEMBL802394)
pH
6±n/a
IC50
45±n/a nM
Comments
extracted
Citation
 Baker, WRFung, AKKleinert, HDStein, HHPlattner, JJArmiger, YLCondon, SLCohen, JEgan, DABarlow, JL Nonpeptide renin inhibitors employing a novel 3-aza(or oxa)-2,4-dialkyl glutaric acid moiety as a P2/P3 amide bond replacement. J Med Chem 35:1722-34 (1992)  
Target
Name:
Renin
Synonyms:
Angiotensinogenase RENI_HUMAN
Type:
Enzyme
Mol. Mass.:
45058.99
Organism:
Homo sapiens (Human)
Description:
Residue:
406
  
Inhibitor
Name:
BDBM50006156
Synonyms:
2-(1-Benzyl-2-morpholin-4-yl-2-oxo-ethoxy)-N-(1-cyclohexylmethyl-2,3-dihydroxy-5-methyl-hexyl)-propionamide | CHEMBL48088
Type:
Small organic molecule
Emp. Form.:
C30H48N2O6
Mol. Mass.:
532.7119
SMILES:
CC(C)C[C@H](O)[C@H](O)[C@H](CC1CCCCC1)NC(=O)[C@H](C)O[C@@H](Cc1ccccc1)C(=O)N1CCOCC1
: