Target
Renin
Ligand
BDBM50006168
Substrate
Meas. Tech.
ChEBML_195793
pH
7.4±n/a
IC50
5.5±n/a nM
Comments
extracted
Citation
 Baker, WRFung, AKKleinert, HDStein, HHPlattner, JJArmiger, YLCondon, SLCohen, JEgan, DABarlow, JL Nonpeptide renin inhibitors employing a novel 3-aza(or oxa)-2,4-dialkyl glutaric acid moiety as a P2/P3 amide bond replacement. J Med Chem 35:1722-34 (1992)  
Target
Name:
Renin
Synonyms:
Angiotensinogenase RENI_HUMAN
Type:
Enzyme
Mol. Mass.:
45058.99
Organism:
Homo sapiens (Human)
Description:
Residue:
406
  
Inhibitor
Name:
BDBM50006168
Synonyms:
2-(2-Azetidin-1-yl-1-benzyl-2-oxo-ethoxy)-N-(1-cyclohexylmethyl-2,3-dihydroxy-5-methyl-hexyl)-propionamide | CHEMBL50213
Type:
Small organic molecule
Emp. Form.:
C29H46N2O5
Mol. Mass.:
502.6859
SMILES:
CC(C)C[C@H](O)[C@H](O)[C@H](CC1CCCCC1)NC(=O)[C@H](C)O[C@@H](Cc1ccccc1)C(=O)N1CCC1
: