Target
Adenosylhomocysteinase
Ligand
BDBM50006217
Substrate
Meas. Tech.
ChEBML_196726
Ki
586±n/a nM
Citation
 Wolfe, MSLee, YBartlett, WJBorcherding, DRBorchardt, RT 4'-modified analogues of aristeromycin and neplanocin A: synthesis and inhibitory activity toward S-adenosyl-L-homocysteine hydrolase. J Med Chem 35:1782-91 (1992)  
Target
Name:
Adenosylhomocysteinase
Synonyms:
AHCY SAHH | SAHH_HUMAN
Type:
PROTEIN
Mol. Mass.:
47714.06
Organism:
Homo sapiens (Human)
Description:
ChEMBL_1507791
Residue:
432
  
Inhibitor
Name:
BDBM50006217
Synonyms:
3-(6-Amino-purin-9-yl)-5-ethyl-cyclopentane-1,2-diol | CHEMBL296392
Type:
Small organic molecule
Emp. Form.:
C12H17N5O2
Mol. Mass.:
263.2957
SMILES:
CC[C@H]1C[C@H]([C@H](O)[C@@H]1O)n1cnc2c(N)ncnc12
: