Target
Adenosylhomocysteinase
Ligand
BDBM50006222
Substrate
Meas. Tech.
ChEMBL_196726 (CHEMBL804128)
Ki
3.8±n/a nM
Citation
 Wolfe, MSLee, YBartlett, WJBorcherding, DRBorchardt, RT 4'-modified analogues of aristeromycin and neplanocin A: synthesis and inhibitory activity toward S-adenosyl-L-homocysteine hydrolase. J Med Chem 35:1782-91 (1992)  
Target
Name:
Adenosylhomocysteinase
Synonyms:
AHCY SAHH | SAHH_HUMAN
Type:
PROTEIN
Mol. Mass.:
47714.06
Organism:
Homo sapiens (Human)
Description:
ChEMBL_1507791
Residue:
432
  
Inhibitor
Name:
BDBM50006222
Synonyms:
(1S,2R,5R)-5-(6-Amino-purin-9-yl)-3-hydroxymethyl-cyclopent-3-ene-1,2-diol 5-(6-Amino-purin-9-yl)-3-hydroxymethyl-cyclopent-3-ene-1,2-diol 5-(6-Amino-purin-9-yl)-3-hydroxymethyl-cyclopent-3-ene-1,2-diol (Neplonocin A) 5-(6-Amino-purin-9-yl)-3-hydroxymethyl-cyclopent-3-ene-1,2-diol(NPA) CHEMBL8771 | Neplanocin A
Type:
Small organic molecule
Emp. Form.:
C11H13N5O3
Mol. Mass.:
263.2526
SMILES:
Nc1ncnc2n(cnc12)[C@@H]1C=C(CO)[C@@H](O)[C@H]1O
: