Target
Potassium voltage-gated channel subfamily H member 2
Ligand
BDBM50251098
Substrate
Meas. Tech.
ChEMBL_1683128 (CHEMBL4033405)
IC50
>40000±n/a nM
Citation
 Hao, CZhao, FSong, HGuo, JLi, XJiang, XHuan, RSong, SZhang, QWang, RWang, KPang, YLiu, TLu, THuang, WWang, JLin, BHe, ZLi, HLi, FZhao, DCheng, M Structure-Based Design of 6-Chloro-4-aminoquinazoline-2-carboxamide Derivatives as Potent and Selective p21-Activated Kinase 4 (PAK4) Inhibitors. J Med Chem 61:265-285 (2018)  
Target
Name:
Potassium voltage-gated channel subfamily H member 2
Synonyms:
1,3-beta-glucan synthase component GLS2 ERG Eag-related protein 1 Ether-a-go-go-related gene (HERG) Ether-a-go-go-related gene potassium channel 1 Ether-a-go-go-related gene potassium channel 1 (hERG1) Ether-a-go-go-related protein 1 H-ERG KCNH2 Potassium voltage-gated channel subfamily H member 2 (hERG) Voltage-gated potassium channel subunit Kv11.1 hERG Potassium Channel 1 | putative potassium channel subunit
Type:
Multi-pass membrane protein
Mol. Mass.:
126672.65
Organism:
Homo sapiens (Human)
Description:
Q12809
Residue:
1159
  
Inhibitor
Name:
BDBM50251098
Synonyms:
CHEMBL4097816
Type:
Small organic molecule
Emp. Form.:
C20H22ClN7O
Mol. Mass.:
411.888
SMILES:
C[C@@H]1CN(CCN1)C(=O)c1nc(Nc2cc([nH]n2)C2CC2)c2cc(Cl)ccc2n1
: