Target
Serine/threonine-protein kinase PAK 4
Ligand
BDBM50251150
Substrate
Meas. Tech.
ChEMBL_1683091 (CHEMBL4033368)
Ki
3817±n/a nM
Citation
 Hao, CZhao, FSong, HGuo, JLi, XJiang, XHuan, RSong, SZhang, QWang, RWang, KPang, YLiu, TLu, THuang, WWang, JLin, BHe, ZLi, HLi, FZhao, DCheng, M Structure-Based Design of 6-Chloro-4-aminoquinazoline-2-carboxamide Derivatives as Potent and Selective p21-Activated Kinase 4 (PAK4) Inhibitors. J Med Chem 61:265-285 (2018)  
Target
Name:
Serine/threonine-protein kinase PAK 4
Synonyms:
KIAA1142 PAK4_HUMAN | p21-Activated kinase 4 (PAK4)
Type:
Protein
Mol. Mass.:
64098.01
Organism:
Homo sapiens (Human)
Description:
O96013
Residue:
591
  
Inhibitor
Name:
BDBM50251150
Synonyms:
CHEMBL4096333
Type:
Small organic molecule
Emp. Form.:
C18H19ClN6O2
Mol. Mass.:
386.835
SMILES:
Cc1cc(Nc2nc(nc3ccc(Cl)cc23)C(=O)N2CCC(O)CC2)n[nH]1
: