Target
Serine/threonine-protein kinase PAK 4
Ligand
BDBM50251142
Substrate
Meas. Tech.
ChEMBL_1683091 (CHEMBL4033368)
Ki
11±n/a nM
Citation
 Hao, CZhao, FSong, HGuo, JLi, XJiang, XHuan, RSong, SZhang, QWang, RWang, KPang, YLiu, TLu, THuang, WWang, JLin, BHe, ZLi, HLi, FZhao, DCheng, M Structure-Based Design of 6-Chloro-4-aminoquinazoline-2-carboxamide Derivatives as Potent and Selective p21-Activated Kinase 4 (PAK4) Inhibitors. J Med Chem 61:265-285 (2018)  
Target
Name:
Serine/threonine-protein kinase PAK 4
Synonyms:
KIAA1142 PAK4_HUMAN | p21-Activated kinase 4 (PAK4)
Type:
Protein
Mol. Mass.:
64098.01
Organism:
Homo sapiens (Human)
Description:
O96013
Residue:
591
  
Inhibitor
Name:
BDBM50251142
Synonyms:
CHEMBL4089338
Type:
Small organic molecule
Emp. Form.:
C20H22BrN7O
Mol. Mass.:
456.339
SMILES:
C[C@@H]1CN(CCN1)C(=O)c1nc(Nc2cc([nH]n2)C2CC2)c2cc(Br)ccc2n1
: