Target
Serine/threonine-protein kinase PAK 4
Ligand
BDBM50251198
Substrate
Meas. Tech.
ChEMBL_1683091 (CHEMBL4033368)
Ki
51±n/a nM
Citation
 Hao, CZhao, FSong, HGuo, JLi, XJiang, XHuan, RSong, SZhang, QWang, RWang, KPang, YLiu, TLu, THuang, WWang, JLin, BHe, ZLi, HLi, FZhao, DCheng, M Structure-Based Design of 6-Chloro-4-aminoquinazoline-2-carboxamide Derivatives as Potent and Selective p21-Activated Kinase 4 (PAK4) Inhibitors. J Med Chem 61:265-285 (2018)  
Target
Name:
Serine/threonine-protein kinase PAK 4
Synonyms:
KIAA1142 PAK4_HUMAN | p21-Activated kinase 4 (PAK4)
Type:
Protein
Mol. Mass.:
64098.01
Organism:
Homo sapiens (Human)
Description:
O96013
Residue:
591
  
Inhibitor
Name:
BDBM50251198
Synonyms:
CHEMBL4079783
Type:
Small organic molecule
Emp. Form.:
C18H20ClN7O
Mol. Mass.:
385.851
SMILES:
C[C@@H]1CN(CCN1)C(=O)c1nc(Nc2cc(C)[nH]n2)c2cc(Cl)ccc2n1
: