Target
Serine/threonine-protein kinase PAK 1
Ligand
BDBM50251198
Substrate
Meas. Tech.
ChEBML_1683096
Ki
>10000±n/a nM
Citation
 Hao, CZhao, FSong, HGuo, JLi, XJiang, XHuan, RSong, SZhang, QWang, RWang, KPang, YLiu, TLu, THuang, WWang, JLin, BHe, ZLi, HLi, FZhao, DCheng, M Structure-Based Design of 6-Chloro-4-aminoquinazoline-2-carboxamide Derivatives as Potent and Selective p21-Activated Kinase 4 (PAK4) Inhibitors. J Med Chem 61:265-285 (2018)  
Target
Name:
Serine/threonine-protein kinase PAK 1
Synonyms:
2.7.11.1 Cell division control protein 42 homolog PAK-1 PAK1_HUMAN p21-activated kinase 1 | p65-PAK
Type:
Mol. Mass.:
60640.15
Organism:
Homo sapiens (Human)
Description:
Q13153
Residue:
545
  
Inhibitor
Name:
BDBM50251198
Synonyms:
CHEMBL4079783
Type:
Small organic molecule
Emp. Form.:
C18H20ClN7O
Mol. Mass.:
385.851
SMILES:
C[C@@H]1CN(CCN1)C(=O)c1nc(Nc2cc(C)[nH]n2)c2cc(Cl)ccc2n1
: