Target
Renin
Ligand
BDBM50006423
Substrate
Meas. Tech.
ChEBML_196103
IC50
1290±n/a nM
Citation
 Ashton, WTCantone, CLMeurer, LCTolman, RLGreenlee, WJPatchett, AALynch, RJSchorn, TWStrouse, JFSiegl, PK Renin inhibitors containing C-termini derived from mercaptoheterocycles. J Med Chem 35:2103-12 (1992)  
Target
Name:
Renin
Synonyms:
Angiotensinogenase RENI_HUMAN
Type:
Enzyme
Mol. Mass.:
45058.99
Organism:
Homo sapiens (Human)
Description:
Residue:
406
  
Inhibitor
Name:
BDBM50006423
Synonyms:
CHEMBL303699 | {1-[1-(1-Cyclohexylmethyl-3-{1-[(2-dimethylamino-ethylcarbamoyl)-methyl]-1H-tetrazol-5-ylsulfanyl}-2-hydroxy-propylcarbamoyl)-2-(1H-imidazol-4-yl)-ethylcarbamoyl]-2-phenyl-ethyl}-carbamic acid tert-butyl ester; hydrate
Type:
Small organic molecule
Emp. Form.:
C37H57N11O6S
Mol. Mass.:
783.984
SMILES:
CN(C)CCNC(=O)Cn1nnnc1SC[C@H](O)[C@H](CC1CCCCC1)NC(=O)[C@H](Cc1cnc[nH]1)NC(=O)[C@H](Cc1ccccc1)NC(=O)OC(C)(C)C
: