Target
Dual specificity tyrosine-phosphorylation-regulated kinase 1A
Ligand
BDBM50251456
Substrate
Meas. Tech.
ChEBML_1683762
IC50
1.000000±n/a nM
Citation
 Shaw, SJGoff, DALin, NSingh, RLi, WMcLaughlin, JBaltgalvis, KAPayan, DGKinsella, TM Developing DYRK inhibitors derived from the meridianins as a means of increasing levels of NFAT in the nucleus. Bioorg Med Chem Lett 27:2617-2621 (2017)  
Target
Name:
Dual specificity tyrosine-phosphorylation-regulated kinase 1A
Synonyms:
DYR1A_HUMAN DYRK1A Dual specificity YAK1-related kinase 1A (Dyrk1A) Dual-specificity tyrosine-phosphorylation regulated kinase 1A HP86 MNBH
Type:
Enzyme
Mol. Mass.:
85616.61
Organism:
Homo sapiens (Human)
Description:
Q13627
Residue:
763
  
Inhibitor
Name:
BDBM50251456
Synonyms:
CHEMBL4084955
Type:
Small organic molecule
Emp. Form.:
C12H9N3
Mol. Mass.:
195.22
SMILES:
c1[nH]c2cnccc2c1-c1ccncc1
: