Target
Aldo-keto reductase family 1 member B1
Ligand
BDBM50006460
Substrate
Meas. Tech.
ChEBML_31769
IC50
6200±n/a nM
Citation
 Mylari, BLZembrowski, WJBeyer, TAAldinger, CESiegel, TW Orally active aldose reductase inhibitors: indazoleacetic, oxopyridazineacetic, and oxopyridopyridazineacetic acid derivatives. J Med Chem 35:2155-62 (1992)  
Target
Name:
Aldo-keto reductase family 1 member B1
Synonyms:
AKR1B1 ALDR_HUMAN AR Aldose Reductase (ALR2) Aldose reductase (AR)
Type:
Protein
Mol. Mass.:
35855.50
Organism:
Homo sapiens (Human)
Description:
P15121. 4LAU; 2IKI; 4LB4; 2FZD; 2FZ8; 1US0
Residue:
316
  
Inhibitor
Name:
BDBM50006460
Synonyms:
CHEMBL306222 | [1-(4-Bromo-2-fluoro-benzyl)-1H-indazol-3-yl]-acetic acid
Type:
Small organic molecule
Emp. Form.:
C16H12BrFN2O2
Mol. Mass.:
363.181
SMILES:
OC(=O)Cc1nn(Cc2ccc(Br)cc2F)c2ccccc12
: