Target
Muscarinic acetylcholine receptor M1
Ligand
BDBM50006580
Substrate
Meas. Tech.
ChEMBL_138797 (CHEMBL751533)
IC50
43±n/a nM
Citation
 Sauerberg, POlesen, PHNielsen, STreppendahl, SSheardown, MJHonoré, TMitch, CHWard, JSPike, AJBymaster, FP Novel functional M1 selective muscarinic agonists. Synthesis and structure-activity relationships of 3-(1,2,5-thiadiazolyl)-1,2,5,6-tetrahydro-1-methylpyridines . J Med Chem 35:2274-83 (1992)  
Target
Name:
Muscarinic acetylcholine receptor M1
Synonyms:
ACM1_RAT Chrm-1 cholinergic receptor, muscarinic 1
Type:
Enzyme Catalytic Domain
Mol. Mass.:
51390.46
Organism:
RAT
Description:
P08482
Residue:
460
  
Inhibitor
Name:
BDBM50006580
Synonyms:
1-Methyl-5-(4-methylsulfanyl-[1,2,5]thiadiazol-3-yl)-1,2,3,6-tetrahydro-pyridine; oxalic acid CHEMBL308608
Type:
Small organic molecule
Emp. Form.:
C9H13N3S2
Mol. Mass.:
227.35
SMILES:
CSc1nsnc1C1=CCCN(C)C1
: