Target
Thymidylate synthase
Ligand
BDBM50006689
Substrate
Meas. Tech.
ChEBML_225607
IC50
20±n/a nM
Citation
 Thornton, TJJackman, ALMarsham, PRO'Connor, BMBishop, JACalvert, AH Quinazoline antifolate thymidylate synthase inhibitors: difluoro-substituted benzene ring analogues. J Med Chem 35:2321-7 (1992)  
Target
Name:
Thymidylate synthase
Synonyms:
TS TYSY_MOUSE | Tyms
Type:
PROTEIN
Mol. Mass.:
34957.15
Organism:
Mus musculus
Description:
ChEMBL_1340097
Residue:
307
  
Inhibitor
Name:
BDBM50006689
Synonyms:
(S)-2-(2-fluoro-4-(((2-methyl-4-oxo-3,4-dihydroquinazolin-6-yl)methyl)(prop-2-ynyl)amino)benzamido)pentanedioic acid 2-{2-Fluoro-4-[(2-methyl-4-oxo-3,4-dihydro-quinazolin-6-ylmethyl)-prop-2-ynyl-amino]-benzoylamino}-pentanedioic acid ;hydrate CHEMBL169981
Type:
Small organic molecule
Emp. Form.:
C25H23FN4O6
Mol. Mass.:
494.4717
SMILES:
Cc1nc2ccc(CN(CC#C)c3ccc(C(=O)N[C@@H](CCC(O)=O)C(O)=O)c(F)c3)cc2c(=O)[nH]1
: