Target
Adenosine receptor A1
Ligand
BDBM50004572
Substrate
Meas. Tech.
ChEMBL_29614 (CHEMBL639638)
Ki
2300±n/a nM
Citation
 Shimada, JSuzuki, FNonaka, HIshii, AIchikawa, S (E)-1,3-dialkyl-7-methyl-8-(3,4,5-trimethoxystyryl)xanthines: potent and selective adenosine A2 antagonists. J Med Chem 35:2342-5 (1992)  
Target
Name:
Adenosine receptor A1
Synonyms:
AA1R_RAT ADENOSINE A1 high Adenosine A1 receptor (A1) Adenosine receptors A1 | Adora1
Type:
Protein
Mol. Mass.:
36704.13
Organism:
Rattus norvegicus (rat)
Description:
Residue:
326
  
Inhibitor
Name:
BDBM50004572
Synonyms:
8-Cyclopentyl-7-methyl-1,3-dipropyl-3,7-dihydro-purine-2,6-dione | CHEMBL22099
Type:
Small organic molecule
Emp. Form.:
C17H26N4O2
Mol. Mass.:
318.4139
SMILES:
CCCn1c2nc(C3CCCC3)n(C)c2c(=O)n(CCC)c1=O
: