Target
Adenosine receptor A2a/A2b
Ligand
BDBM50006699
Substrate
Meas. Tech.
ChEMBL_27939 (CHEMBL649120)
Ki
2200±n/a nM
Citation
 Shimada, JSuzuki, FNonaka, HIshii, AIchikawa, S (E)-1,3-dialkyl-7-methyl-8-(3,4,5-trimethoxystyryl)xanthines: potent and selective adenosine A2 antagonists. J Med Chem 35:2342-5 (1992)  
Target
Name:
Adenosine receptor A2a/A2b
Synonyms:
Adenosine A2 receptor
Type:
Mol. Mass.:
Description:
ASSAY_ID of ChEMBL is 30560
Components:
This complex has 2 components.
Component 1
Name:
Adenosine receptor A2b
Synonyms:
AA2BR_RAT Adora2b
Type:
PROTEIN
Mol. Mass.:
36378.84
Organism:
Rattus norvegicus
Description:
ChEMBL_32934
Residue:
332
  
Component 2
Name:
Adenosine receptor A2a
Synonyms:
AA2AR_RAT Adenosine A2 receptor Adenosine Receptors A2a (A2a) Adenosine receptors A2a Rat striatal adenosine A2a receptor
Type:
G Protein-Coupled Receptor (GPCR)
Mol. Mass.:
45015.65
Organism:
Rattus norvegicus (rat)
Description:
Rat A2A receptors expressed in CHO cells.
Residue:
410
  
Inhibitor
Name:
BDBM50006699
Synonyms:
3-Propyl-8-[2-(3,4,5-trimethoxy-phenyl)-vinyl]-3,7-dihydro-purine-2,6-dione | CHEMBL76482
Type:
Small organic molecule
Emp. Form.:
C19H22N4O5
Mol. Mass.:
386.4018
SMILES:
CCCn1c2nc(C=Cc3cc(OC)c(OC)c(OC)c3)[nH]c2c(=O)[nH]c1=O
: