Target
Histone deacetylase 2
Ligand
BDBM50380399
Substrate
Meas. Tech.
ChEMBL_1684723 (CHEMBL4035202)
IC50
>30000±n/a nM
Citation
 De Vreese, RD'hooghe, M Synthesis and applications of benzohydroxamic acid-based histone deacetylase inhibitors. Eur J Med Chem 135:174-195 (2017)  
Target
Name:
Histone deacetylase 2
Synonyms:
Cereblon/Histone deacetylase 2 HDAC2 Histone deacetylase 2 (HDAC2) | Human HDAC2
Type:
Chromatin regulator; hydrolase; repressor
Mol. Mass.:
55356.54
Organism:
Homo sapiens (Human)
Description:
Q92769
Residue:
488
  
Inhibitor
Name:
BDBM50380399
Synonyms:
CHEMBL2018302 US10227295, Compound Tubastatin A US11207431, Example D US9249087, Tubacin US9956192, Compound Tubastatin-A
Type:
Small organic molecule
Emp. Form.:
C20H21N3O2
Mol. Mass.:
335.3996
SMILES:
CN1CCc2c(C1)c1ccccc1n2Cc1ccc(cc1)C(=O)NO
: