Target
Folylpolyglutamate synthase, mitochondrial
Ligand
BDBM50006907
Substrate
Meas. Tech.
ChEBML_68805
Ki
2000±n/a nM
Citation
 Rosowsky, AForsch, RAMoran, RG N-[4-[[(3,4-dihydro-4-oxo-1,2,3-benzotriazin-6- yl)methyl]amino]benzoyl]-L-glutamic acid, a novel A-ring analogue of 2-desamino-5,8-dideazafolic acid. J Med Chem 35:2626-30 (1992)  
Target
Name:
Folylpolyglutamate synthase, mitochondrial
Synonyms:
FOLC_MOUSE Folylpolyglutamate synthase, mitochondrial Tetrahydrofolate synthase | Tetrahydrofolylpolyglutamate synthase
Type:
PROTEIN
Mol. Mass.:
64969.76
Organism:
Mus musculus
Description:
ChEMBL_68680
Residue:
587
  
Inhibitor
Name:
BDBM50006907
Synonyms:
2-{4-[(4-Oxo-3,4-dihydro-quinazolin-6-ylmethyl)-amino]-benzoylamino}-pentanedioic acid | CHEMBL89641
Type:
Small organic molecule
Emp. Form.:
C21H20N4O6
Mol. Mass.:
424.4067
SMILES:
OC(=O)CCC(NC(=O)c1ccc(NCc2ccc3nc[nH]c(=O)c3c2)cc1)C(O)=O
: