Target
Polyunsaturated fatty acid 5-lipoxygenase
Ligand
BDBM50007043
Substrate
Meas. Tech.
ChEBML_3800
IC50
6300±n/a nM
Citation
 Bird, naBruneau, PCrawley, GCEdwards, MPFoster, SJGirodeau, JMKingston, JFMcMillan, RM (Methoxyalkyl)thiazoles: a new series of potent, selective, and orally active 5-lipoxygenase inhibitors displaying high enantioselectivity. J Med Chem 34:2176-86 (1991)  
Target
Name:
Polyunsaturated fatty acid 5-lipoxygenase
Synonyms:
5-LO 5-Lipoxygenase (5-LO) 5-Lipoygenase ALOX5 LOG5 | LOX5_HUMAN
Type:
Enzyme
Mol. Mass.:
77972.74
Organism:
Homo sapiens (Human)
Description:
Recombinant protein was purified from E. coli lysate. After ammonium sulfate precipitation and subsequent steps, the supernatant (S100) was used for 5-LO activity assay.
Residue:
674
  
Inhibitor
Name:
BDBM50007043
Synonyms:
(3-Decyloxy-phenyl)-(5-methyl-1H-imidazol-2-yl)-methanol | CHEMBL71332
Type:
Small organic molecule
Emp. Form.:
C21H32N2O2
Mol. Mass.:
344.491
SMILES:
CCCCCCCCCCOc1cccc(c1)C(O)c1ncc(C)[nH]1
: