Target
Polyunsaturated fatty acid 5-lipoxygenase
Ligand
BDBM50007048
Substrate
Meas. Tech.
ChEMBL_3799 (CHEMBL619874)
IC50
40000±n/a nM
Citation
 Bird, naBruneau, PCrawley, GCEdwards, MPFoster, SJGirodeau, JMKingston, JFMcMillan, RM (Methoxyalkyl)thiazoles: a new series of potent, selective, and orally active 5-lipoxygenase inhibitors displaying high enantioselectivity. J Med Chem 34:2176-86 (1991)  
Target
Name:
Polyunsaturated fatty acid 5-lipoxygenase
Synonyms:
5-LO 5-Lipoxygenase (5-LO) 5-Lipoygenase ALOX5 LOG5 | LOX5_HUMAN
Type:
Enzyme
Mol. Mass.:
77972.74
Organism:
Homo sapiens (Human)
Description:
Recombinant protein was purified from E. coli lysate. After ammonium sulfate precipitation and subsequent steps, the supernatant (S100) was used for 5-LO activity assay.
Residue:
674
  
Inhibitor
Name:
BDBM50007048
Synonyms:
2-Methyl-1-[3-(naphthalen-2-ylmethoxy)-phenyl]-1-thiazol-2-yl-propan-1-ol | CHEMBL71552
Type:
Small organic molecule
Emp. Form.:
C24H23NO2S
Mol. Mass.:
389.51
SMILES:
CC(C)C(O)(c1nccs1)c1cccc(OCc2ccc3ccccc3c2)c1
: