Target
Carbonic anhydrase 1
Ligand
BDBM50252992
Substrate
Meas. Tech.
ChEMBL_1685229 (CHEMBL4035708)
Ki
0.120000±n/a nM
Citation
 Alt?ntop, MDSever, BÖzdemir, AKucukoglu, KOnem, HNadaroglu, HKaplanc?kl?, ZA Potential inhibitors of human carbonic anhydrase isozymes I and II: Design, synthesis and docking studies of new 1,3,4-thiadiazole derivatives. Bioorg Med Chem 25:3547-3554 (2017)  
Target
Name:
Carbonic anhydrase 1
Synonyms:
CA-I CAB Carbonate dehydratase I Carbonic anhydrase 1 (CA I) Carbonic anhydrase 1 (Recombinant CA I) Carbonic anhydrase B Carbonic anhydrase I (CA I) Carbonic anhydrase I (CAI) Carbonic anhydrase isoenzyme I (hCA I) | hCA
Type:
Enzyme
Mol. Mass.:
28873.37
Organism:
Homo sapiens (Human)
Description:
P00915
Residue:
261
  
Inhibitor
Name:
BDBM50252992
Synonyms:
CHEMBL4100496
Type:
Small organic molecule
Emp. Form.:
C21H16ClN5O2S2
Mol. Mass.:
469.967
SMILES:
Clc1ccc(cc1)-c1ccc(\C=N\NC(=O)CSc2nnc(Nc3ccccc3)s2)o1
: