Target
D(1A) dopamine receptor
Ligand
BDBM50007147
Substrate
Meas. Tech.
ChEBML_60188
EC50
5.1±n/a nM
Citation
 DeNinno, MPSchoenleber, RPerner, RJLijewski, LAsin, KEBritton, DRMacKenzie, RKebabian, JW Synthesis and dopaminergic activity of 3-substituted 1-(aminomethyl)-3,4-dihydro-5,6-dihydroxy-1H-2-benzopyrans: characterization of an auxiliary binding region in the D1 receptor. J Med Chem 34:2561-9 (1991)  
Target
Name:
D(1A) dopamine receptor
Synonyms:
DA D1 receptor DRD1 Dopamine D1 receptor Dopamine D1A
Type:
Enzyme
Mol. Mass.:
49303.43
Organism:
Homo sapiens (Human)
Description:
P21728
Residue:
446
  
Inhibitor
Name:
BDBM50007147
Synonyms:
3-Adamantan-1-yl-1-aminomethyl-isochroman-5,6-diol | CHEMBL313530
Type:
Small organic molecule
Emp. Form.:
C20H27NO3
Mol. Mass.:
329.4333
SMILES:
NC[C@@H]1OC(Cc2c(O)c(O)ccc12)C12C[C@H]3C[C@H](C[C@H](C3)C1)C2
: