Target
D(1A) dopamine receptor
Ligand
BDBM50007142
Substrate
Meas. Tech.
ChEBML_60521
Ki
2510±n/a nM
Citation
 DeNinno, MPSchoenleber, RPerner, RJLijewski, LAsin, KEBritton, DRMacKenzie, RKebabian, JW Synthesis and dopaminergic activity of 3-substituted 1-(aminomethyl)-3,4-dihydro-5,6-dihydroxy-1H-2-benzopyrans: characterization of an auxiliary binding region in the D1 receptor. J Med Chem 34:2561-9 (1991)  
Target
Name:
D(1A) dopamine receptor
Synonyms:
DOPAMINE D1 Dopamine D1 high Dopamine receptor Dopamine1-like Drd1a
Type:
Enzyme Catalytic Domain
Mol. Mass.:
49429.75
Organism:
RAT
Description:
P18901
Residue:
446
  
Inhibitor
Name:
BDBM50007142
Synonyms:
3-Cyclohexyl-1-[(methyl-prop-2-ynyl-amino)-methyl]-isochroman-5,6-diol | CHEMBL315535
Type:
Small organic molecule
Emp. Form.:
C20H27NO3
Mol. Mass.:
329.4333
SMILES:
CN(CC#C)C[C@@H]1OC(Cc2c(O)c(O)ccc12)C1CCCCC1
: