Target
D(1A) dopamine receptor
Ligand
BDBM50453080
Substrate
Meas. Tech.
ChEBML_60521
Ki
1760±n/a nM
Citation
 DeNinno, MPSchoenleber, RPerner, RJLijewski, LAsin, KEBritton, DRMacKenzie, RKebabian, JW Synthesis and dopaminergic activity of 3-substituted 1-(aminomethyl)-3,4-dihydro-5,6-dihydroxy-1H-2-benzopyrans: characterization of an auxiliary binding region in the D1 receptor. J Med Chem 34:2561-9 (1991)  
Target
Name:
D(1A) dopamine receptor
Synonyms:
DOPAMINE D1 Dopamine D1 high Dopamine receptor Dopamine1-like Drd1a
Type:
Enzyme Catalytic Domain
Mol. Mass.:
49429.75
Organism:
RAT
Description:
P18901
Residue:
446
  
Inhibitor
Name:
BDBM50453080
Synonyms:
CHEMBL2114209
Type:
Small organic molecule
Emp. Form.:
C12H17NO3
Mol. Mass.:
223.2683
SMILES:
CC[C@H]1Cc2c(O)c(O)ccc2[C@H](CN)O1
: