Target
D(2) dopamine receptor
Ligand
BDBM50007149
Substrate
Meas. Tech.
ChEMBL_62257 (CHEMBL675484)
Ki
776±n/a nM
Citation
 DeNinno, MPSchoenleber, RPerner, RJLijewski, LAsin, KEBritton, DRMacKenzie, RKebabian, JW Synthesis and dopaminergic activity of 3-substituted 1-(aminomethyl)-3,4-dihydro-5,6-dihydroxy-1H-2-benzopyrans: characterization of an auxiliary binding region in the D1 receptor. J Med Chem 34:2561-9 (1991)  
Target
Name:
D(2) dopamine receptor
Synonyms:
DOPAMINE D2 DOPAMINE D2 Short Dopamine D2 receptor Drd2
Type:
G Protein-Coupled Receptor (GPCR)
Mol. Mass.:
50931.60
Organism:
Rattus norvegicus (rat)
Description:
P61169
Residue:
444
  
Inhibitor
Name:
BDBM50007149
Synonyms:
1-Aminomethyl-3-cyclopentylmethyl-isochroman-5,6-diol | CHEMBL85409
Type:
Small organic molecule
Emp. Form.:
C16H23NO3
Mol. Mass.:
277.3587
SMILES:
NC[C@@H]1OC(CC2CCCC2)Cc2c(O)c(O)ccc12
: