Target
Delta-type opioid receptor
Ligand
BDBM50007167
Substrate
Meas. Tech.
ChEBML_146436
Ki
>1000±n/a nM
Citation
 Vecchietti, VClarke, GDColle, RGiardina, GPetrone, GSbacchi, M (1S)-1-(aminomethyl)-2-(arylacetyl)-1,2,3,4-tetrahydroisoquinoline and heterocycle-condensed tetrahydropyridine derivatives: members of a novel class of very potent kappa opioid analgesics. J Med Chem 34:2624-33 (1991)  
Target
Name:
Delta-type opioid receptor
Synonyms:
D-OR-1 Delta opioid receptor OPIATE Delta OPRD1 OPRK1 | opioid receptor, delta 1
Type:
G Protein-Coupled Receptor (GPCR)
Mol. Mass.:
40382.98
Organism:
Homo sapiens (Human)
Description:
Competition binding assays were carried out using membrane preparations from transfected HN9.10 cells that constitutively expressed the delta opioid receptor.
Residue:
372
  
Inhibitor
Name:
BDBM50007167
Synonyms:
1-(4-Piperidin-1-ylmethyl-6,7-dihydro-4H-thieno[3,2-c]pyridin-5-yl)-2-(4-trifluoromethyl-phenyl)-ethanone;C4H6O6 | CHEMBL329114
Type:
Small organic molecule
Emp. Form.:
C22H25F3N2OS
Mol. Mass.:
422.507
SMILES:
FC(F)(F)c1ccc(CC(=O)N2CCc3sccc3C2CN2CCCCC2)cc1
: