Target
5-hydroxytryptamine receptor 1A
Ligand
BDBM50007171
Substrate
Meas. Tech.
ChEBML_1117
Ki
213±n/a nM
Citation
 Raghupathi, RKRydelek-Fitzgerald, LTeitler, MGlennon, RA Analogues of the 5-HT1A serotonin antagonist 1-(2-methoxyphenyl)-4-[4-(2-phthalimido)butyl]piperazine with reduced alpha 1-adrenergic affinity. J Med Chem 34:2633-8 (1991)  
Target
Name:
5-hydroxytryptamine receptor 1A
Synonyms:
5-HT-1A 5-HT1A 5-hydroxytryptamine receptor 1A (5HT1A) 5ht1a Htr1a Serotonin 1a (5-HT1a) receptor/Adrenergic receptor alpha-1 | Serotonin receptor 1A
Type:
G Protein-Coupled Receptor (GPCR)
Mol. Mass.:
46445.29
Organism:
Rattus norvegicus (rat)
Description:
Binding assays were performed using rat hippocampal membranes.
Residue:
422
  
Inhibitor
Name:
BDBM50007171
Synonyms:
CHEMBL316090 | N-(4-{4-[4-(1,3-Dioxo-1,3-dihydro-isoindol-2-yl)-butyl]-piperazin-1-yl}-phenyl)-acetamide
Type:
Small organic molecule
Emp. Form.:
C24H28N4O3
Mol. Mass.:
420.5041
SMILES:
CC(=O)Nc1ccc(cc1)N1CCN(CCCCN2C(=O)c3ccccc3C2=O)CC1
: