Target
cGMP-dependent 3',5'-cyclic phosphodiesterase
Ligand
BDBM50007222
Substrate
Meas. Tech.
ChEBML_216659
IC50
>100000±n/a nM
Citation
 Meanwell, NARoth, HRSmith, ECWedding, DLWright, JJFleming, JSGillespie, E 1,3-Dihydro-2H-imidazo[4,5-b]quinolin-2-ones--inhibitors of blood platelet cAMP phosphodiesterase and induced aggregation. J Med Chem 34:2906-16 (1991)  
Target
Name:
cGMP-dependent 3',5'-cyclic phosphodiesterase
Synonyms:
CGS-PDE Homo sapiens phosphodiesterase 2A (PDE2A) PDE2A cGSPDE
Type:
Enzyme Catalytic Domain
Mol. Mass.:
105691.58
Organism:
Homo sapiens (Human)
Description:
O00408
Residue:
941
  
Inhibitor
Name:
BDBM50007222
Synonyms:
1,3,9,9a-Tetrahydro-imidazo[4,5-b]quinolin-2-one | CHEMBL98943
Type:
Small organic molecule
Emp. Form.:
C10H9N3O
Mol. Mass.:
187.198
SMILES:
O=c1[nH]c2Cc3ccccc3Nc2[nH]1
: