Target
Histamine H1 receptor
Ligand
BDBM50007474
Substrate
Meas. Tech.
ChEBML_84706
Ki
850.0±n/a nM
Citation
 Piwinski, JJWong, JKGreen, MJGanguly, AKBillah, MMWest, REKreutner, W Dual antagonists of platelet activating factor and histamine. Identification of structural requirements for dual activity of N-Acyl-4-(5,6-dihydro-11H-benzo [5,6]cyclohepta-[1,2-b]pyridin-11-ylidene)piperidines. J Med Chem 34:457-61 (1991)  
Target
Name:
Histamine H1 receptor
Synonyms:
HISTAMINE H1 Hrh1
Type:
Enzyme Catalytic Domain
Mol. Mass.:
55716.35
Organism:
RAT
Description:
HISTAMINE H1 HRH1 RAT::P31390
Residue:
486
  
Inhibitor
Name:
BDBM50007474
Synonyms:
CHEMBL141432 | N-[3-(8-Chloro-5,6-dihydro-benzo[5,6]cyclohepta[1,2-b]pyridin-11-ylidene)-propyl]-N-methyl-acetamide(Z isomer)
Type:
Small organic molecule
Emp. Form.:
C20H21ClN2O
Mol. Mass.:
340.847
SMILES:
CN(CC\C=C1\c2ccc(Cl)cc2CCc2cccnc12)C(C)=O
: