Target
Lysine-specific histone demethylase 1A
Ligand
BDBM50075565
Substrate
Meas. Tech.
ChEMBL_1686155 (CHEMBL4036634)
IC50
3581±n/a nM
Citation
 Ding, LWang, ZZSun, XDYang, JMa, CYLi, WLiu, HM 3D-QSAR (CoMFA, CoMSIA), molecular docking and molecular dynamics simulations study of 6-aryl-5-cyano-pyrimidine derivatives to explore the structure requirements of LSD1 inhibitors. Bioorg Med Chem Lett 27:3521-3528 (2017)  
Target
Name:
Lysine-specific histone demethylase 1A
Synonyms:
AOF2 Flavin-containing amine oxidase domain-containing protein 2 KDM1A KIAA0601 Lysine-specific demethylase 1 (LSD1) Lysine-specific histone demethylase 1 (LSD1)
Type:
Enzyme
Mol. Mass.:
92901.01
Organism:
Homo sapiens (Human)
Description:
O60341
Residue:
852
  
Inhibitor
Name:
BDBM50075565
Synonyms:
CHEMBL3415360
Type:
Small organic molecule
Emp. Form.:
C15H11ClN6S2
Mol. Mass.:
374.871
SMILES:
NC(=S)NNc1nc(SCC#C)nc(-c2cccc(Cl)c2)c1C#N
: