Target
Beta-2 adrenergic receptor
Ligand
BDBM50007477
Substrate
Meas. Tech.
ChEBML_41681
EC50
38±n/a nM
Citation
 Adejare, ANie, JYHebel, DBrackett, LEChoi, OGusovsky, FPadgett, WLDaly, JWCreveling, CRKirk, KL Effect of fluorine substitution on the adrenergic properties of 3-(tert-butylamino)-1-(3,4-dihydroxyphenoxy)-2-propanol. J Med Chem 34:1063-8 (1991)  
Target
Name:
Beta-2 adrenergic receptor
Synonyms:
ADRB2_CAVPO adrenergic Beta2
Type:
Enzyme Catalytic Domain
Mol. Mass.:
46993.24
Organism:
GUINEA PIG
Description:
adrenergic Beta2 ADRB2 GUINEA PIG::Q8K4Z4
Residue:
418
  
Inhibitor
Name:
BDBM50007477
Synonyms:
4-(3-tert-Butylamino-2-hydroxy-propoxy)-3-fluoro-benzene-1,2-diol | CHEMBL10453
Type:
Small organic molecule
Emp. Form.:
C13H20FNO4
Mol. Mass.:
273.3006
SMILES:
CC(C)(C)NCC(O)COc1ccc(O)c(O)c1F
: