Target
Nicotinamide phosphoribosyltransferase
Ligand
BDBM50254197
Substrate
Meas. Tech.
ChEBML_1686176
Ki
9.4±n/a nM
Citation
 Curtin, MLHeyman, HRClark, RFSorensen, BKDoherty, GAHansen, TMFrey, RRSarris, KAAguirre, ALShrestha, ATu, NWoller, KPliushchev, MASweis, RFCheng, MWilsbacher, JLKovar, PJGuo, JCheng, DLongenecker, KLRaich, DKorepanova, AVSoni, NBAlgire, MARichardson, PLMarin, VLBadagnani, IVasudevan, ABuchanan, FGMaag, DChiang, GGTse, CMichaelides, MR SAR and characterization of non-substrate isoindoline urea inhibitors of nicotinamide phosphoribosyltransferase (NAMPT). Bioorg Med Chem Lett 27:3317-3325 (2017)  
Target
Name:
Nicotinamide phosphoribosyltransferase
Synonyms:
NAMPT NAmPRTase Nicotinamide phosphoribosyltransferase (NAMPT) PBEF1 | Pre-B-cell colony-enhancing factor 1
Type:
Enzyme
Mol. Mass.:
55524.98
Organism:
Homo sapiens (Human)
Description:
P43490
Residue:
491
  
Inhibitor
Name:
BDBM50254197
Synonyms:
CHEMBL4077485
Type:
Small organic molecule
Emp. Form.:
C27H33FN4O2
Mol. Mass.:
464.5749
SMILES:
CN1CCC(CC1)C(=O)N1CCC(CC1)c1ccc(NC(=O)N2Cc3ccc(F)cc3C2)cc1
: