Target
Alpha-1A adrenergic receptor
Ligand
BDBM50007551
Substrate
Meas. Tech.
ChEBML_33439
Ki
12.0±n/a nM
Citation
 Froimowitz, MRämsby, S Conformational properties of semirigid antipsychotic drugs: the pharmacophore for dopamine D-2 antagonist activity. J Med Chem 34:1707-14 (1991)  
Target
Name:
Alpha-1A adrenergic receptor
Synonyms:
ADA1A_HUMAN ADRA1C Alpha 1A-adrenoceptor Alpha adrenergic receptor 1a Alpha-adrenergic receptor 1c adrenergic Alpha1 | adrenergic Alpha1C
Type:
Cell-surface receptors
Mol. Mass.:
51511.67
Organism:
Homo sapiens (Human)
Description:
P35348
Residue:
466
  
Inhibitor
Name:
BDBM50007551
Synonyms:
3'-chlorospiro[2-cyclohexene-1,5'-(10',11'-dihydro-5'H-dibenzo[a,d]cycloheptene)]-4-yl(dimethyl)amine Enantiomer 1'3'-chlorospiro[2-cyclohexene-1,5'-(10',11'-dihydro-5'H-dibenzo[a,d]cycloheptene)]-4-yl(dimethyl)amine
Type:
Small organic molecule
Emp. Form.:
C22H24ClN
Mol. Mass.:
337.886
SMILES:
CN(C)C1CCC2(C=C1)c1ccccc1CCc1ccc(Cl)cc21
: