Target
D(2) dopamine receptor
Ligand
BDBM50007568
Substrate
Meas. Tech.
ChEBML_58533
IC50
1.3±n/a nM
Citation
 Bøgesø, KPLiljefors, TArnt, JHyttel, JPedersen, H Octoclothepin enantiomers. A reinvestigation of their biochemical and pharmacological activity in relation to a new receptor-interaction model for dopamine D-2 receptor antagonists. J Med Chem 34:2023-30 (1991)  
Target
Name:
D(2) dopamine receptor
Synonyms:
DOPAMINE D2 DOPAMINE D2 Short Dopamine D2 receptor Drd2
Type:
G Protein-Coupled Receptor (GPCR)
Mol. Mass.:
50931.60
Organism:
Rattus norvegicus (rat)
Description:
P61169
Residue:
444
  
Inhibitor
Name:
BDBM50007568
Synonyms:
1-((S)-8-Chloro-10,11-dihydro-dibenzo[b,f]thiepin-10-yl)-4-methyl-piperazine CHEMBL303313 | OCTOCLOTHEPIN-S
Type:
Small organic molecule
Emp. Form.:
C19H21ClN2S
Mol. Mass.:
344.901
SMILES:
CN1CCN(CC1)[C@H]1Cc2ccccc2Sc2ccc(Cl)cc12
: