Target
Substance-K receptor
Ligand
BDBM50007829
Substrate
Meas. Tech.
ChEBML_209224
EC50
8.3±n/a nM
Citation
 Ward, PEwan, GBJordan, CCIreland, SJHagan, RMBrown, JR Potent and highly selective neurokinin antagonists. J Med Chem 33:1848-51 (1990)  
Target
Name:
Substance-K receptor
Synonyms:
NK-2 receptor NK2R_RAT Neurokinin A receptor SKR Tac2r Tacr2
Type:
Enzyme Catalytic Domain
Mol. Mass.:
43868.63
Organism:
Rattus norvegicus (Rat)
Description:
Neurokinin NK2 TACR2 Murine::P16610
Residue:
390
  
Inhibitor
Name:
BDBM50007829
Synonyms:
2-(1-{2-[2-(4-Amino-butyrylamino)-3-phenyl-propionylamino]-3-phenyl-propionyl}-6-oxo-1,7-diaza-spiro[4.4]non-7-yl)-4-methyl-pentanoic acid (1-carbamoyl-3-methylsulfanyl-propyl)-amide | CHEMBL280020
Type:
Small organic molecule
Emp. Form.:
C40H57N7O6S
Mol. Mass.:
763.989
SMILES:
CSCC[C@H](NC(=O)[C@@H](CC(C)C)N1CCC2(CCCN2C(=O)[C@H](Cc2ccccc2)NC(=O)[C@H](Cc2ccccc2)NC(=O)CCCN)C1=O)C(N)=O
: