Target
Gastrin/cholecystokinin type B receptor
Ligand
BDBM50007933
Substrate
Meas. Tech.
ChEBML_48091
Ki
2200±n/a nM
Citation
 Gonzalez-Muniz, RBergeron, FMarseigne, IDurieux, CRoques, BP Boc-Trp-Orn(Z)-Asp-NH2 and derivatives: a new family of CCK antagonists. J Med Chem 33:3199-204 (1991)  
Target
Name:
Gastrin/cholecystokinin type B receptor
Synonyms:
CCK-2 receptor CCK-BR CCKRB Cholecystokinin receptor GASR_HUMAN | Gastrin/cholecystokinin type B receptor
Type:
G Protein-Coupled Receptor (GPCR)
Mol. Mass.:
48445.79
Organism:
Homo sapiens (Human)
Description:
Stable expression of human CCK-2 receptors in HEK 293 cells.
Residue:
447
  
Inhibitor
Name:
BDBM50007933
Synonyms:
3-{5-tert-Butoxycarbonylamino-2-[2-tert-butoxycarbonylamino-3-(1H-indol-3-yl)-propionylamino]-pentanoylamino}-N-(1-carbamoyl-2-phenyl-ethyl)-succinamic acid | CHEMBL3142842
Type:
Small organic molecule
Emp. Form.:
C39H53N7O10
Mol. Mass.:
779.879
SMILES:
CC(C)(C)OC(=O)NCCC[C@H](NC(=O)[C@H](Cc1c[nH]c2ccccc12)NC(=O)OC(C)(C)C)C(=O)N[C@@H](CC(O)=O)C(=O)N[C@@H](Cc1ccccc1)C(N)=O
: