Target
Gonadotropin-releasing hormone receptor
Ligand
BDBM50007958
Substrate
Meas. Tech.
ChEBML_71439
Kd
0.210000±n/a nM
Citation
 Theobald, PPorter, JRivier, CCorrigan, AHook, WSiraganian, RPerrin, MVale, WRivier, J Novel gonadotropin-releasing hormone antagonists: peptides incorporating modified N omega-cyanoguanidino moieties. J Med Chem 34:2395-402 (1991)  
Target
Name:
Gonadotropin-releasing hormone receptor
Synonyms:
GNRHR_RAT GnRH-R | Gnrhr
Type:
PROTEIN
Mol. Mass.:
37767.60
Organism:
Rattus norvegicus
Description:
ChEMBL_1335047
Residue:
327
  
Inhibitor
Name:
BDBM50007958
Synonyms:
CHEMBL2369860 | pGlu-His-Trp-Ser-Orn(atz)-DOrn(atz)-Leu-ILys-Pro-DAla-NH2
Type:
Small organic molecule
Emp. Form.:
C62H95N25O12
Mol. Mass.:
1382.578
SMILES:
CC(C)C[C@H](NC(=O)[C@@H](CCCNc1n[nH]c(N)n1)NC(=O)[C@H](CCCNc1n[nH]c(N)n1)NC(=O)[C@H](CO)NC(=O)[C@H](Cc1c[nH]c2ccccc12)NC(=O)[C@H](Cc1c[nH]cn1)NC(=O)[C@@H]1CCC(=O)N1)C(=O)N[C@@H](CCCCNC(C)C)C(=O)N1CCC[C@H]1C(=O)N[C@H](C)C(N)=O
: