Target
Neuromedin-K receptor
Ligand
BDBM50007962
Substrate
Meas. Tech.
ChEMBL_141792 (CHEMBL748092)
EC50
0.900000±n/a nM
Citation
 Roubini, ELaufer, RGilon, CSelinger, ZRoques, BPChorev, M Pseudopeptide analogues of substance P and leucine enkephalinamide containing the psi (CH2O) modification: synthesis and biological activity. J Med Chem 34:2430-8 (1991)  
Target
Name:
Neuromedin-K receptor
Synonyms:
NK3R_CAVPO Neurokinin NK3 TACR3
Type:
Enzyme Catalytic Domain
Mol. Mass.:
49456.44
Organism:
GUINEA PIG
Description:
Neurokinin NK3 TACR3 GUINEA PIG::P30098
Residue:
440
  
Inhibitor
Name:
BDBM50007962
Synonyms:
CHEMBL81919 | pGlu6-Phe-NMePhe-Gly-Leu-Met-NH2
Type:
Small organic molecule
Emp. Form.:
C37H51N7O7S
Mol. Mass.:
737.909
SMILES:
CSCC[C@H](NC(=O)[C@H](CC(C)C)NC(=O)CNC(=O)[C@H](Cc1ccccc1)N(C)C(=O)[C@H](Cc1ccccc1)NC(=O)[C@@H]1CCC(=O)N1)C(N)=O
: