Target
Gastrin/cholecystokinin type B receptor
Ligand
BDBM50007976
Substrate
Meas. Tech.
ChEBML_47815
IC50
2000±n/a nM
Citation
 Shiosaki, KLin, CWKopecka, HTufano, MDBianchi, BRMiller, TRWitte, DGNadzan, AM Boc-CCK-4 derivatives containing side-chain ureas as potent and selective CCK-a receptor agonists. J Med Chem 34:2837-42 (1991)  
Target
Name:
Gastrin/cholecystokinin type B receptor
Synonyms:
CCK-2 receptor CCK-BR CCKRB Cholecystokinin receptor GASR_HUMAN | Gastrin/cholecystokinin type B receptor
Type:
G Protein-Coupled Receptor (GPCR)
Mol. Mass.:
48445.79
Organism:
Homo sapiens (Human)
Description:
Stable expression of human CCK-2 receptors in HEK 293 cells.
Residue:
447
  
Inhibitor
Name:
BDBM50007976
Synonyms:
3-[2-[2-tert-Butoxycarbonylamino-3-(1H-indol-3-yl)-propionylamino]-7-(3-o-tolyl-ureido)-heptanoylamino]-N-(1-carbamoyl-2-phenyl-ethyl)-succinamic acid | CHEMBL3142681
Type:
Small organic molecule
Emp. Form.:
C44H56N8O9
Mol. Mass.:
840.9636
SMILES:
Cc1ccccc1NC(=O)NCCCCC[C@H](NC(=O)[C@H](Cc1c[nH]c2ccccc12)NC(=O)OC(C)(C)C)C(=O)N[C@@H](CC(O)=O)C(=O)N[C@@H](Cc1ccccc1)C(N)=O
: