Target
Reverse transcriptase/RNaseH
Ligand
BDBM50008008
Substrate
Meas. Tech.
ChEBML_196945
IC50
>100000±n/a nM
Citation
 Goudgaon, NMSchinazi, RF Activity of acyclic 6-(phenylselenenyl)pyrimidine nucleosides against human immunodeficiency viruses in primary lymphocytes. J Med Chem 34:3305-9 (1991)  
Target
Name:
Reverse transcriptase/RNaseH
Synonyms:
HIV-1 Reverse Transcriptase RNase H Reverse transcriptase/RNaseH
Type:
PROTEIN
Mol. Mass.:
65229.15
Organism:
Human immunodeficiency virus 1
Description:
ChEMBL_1473730
Residue:
566
  
Inhibitor
Name:
BDBM50008008
Synonyms:
5-Fluoro-1-(2-hydroxy-ethoxymethyl)-6-phenylselanyl-1H-pyrimidine-2,4-dione | CHEMBL323914
Type:
Small organic molecule
Emp. Form.:
C13H13FN2O4Se
Mol. Mass.:
359.21
SMILES:
OCCOCn1c([Se]c2ccccc2)c(F)c(=O)[nH]c1=O
: