Target
Reverse transcriptase/RNaseH
Ligand
BDBM50008016
Substrate
Meas. Tech.
ChEBML_196945
IC50
139000±n/a nM
Citation
 Goudgaon, NMSchinazi, RF Activity of acyclic 6-(phenylselenenyl)pyrimidine nucleosides against human immunodeficiency viruses in primary lymphocytes. J Med Chem 34:3305-9 (1991)  
Target
Name:
Reverse transcriptase/RNaseH
Synonyms:
HIV-1 Reverse Transcriptase RNase H Reverse transcriptase/RNaseH
Type:
PROTEIN
Mol. Mass.:
65229.15
Organism:
Human immunodeficiency virus 1
Description:
ChEMBL_1473730
Residue:
566
  
Inhibitor
Name:
BDBM50008016
Synonyms:
1-(2-Hydroxy-ethoxymethyl)-6-phenylselanyl-1H-pyrimidine-2,4-dione | CHEMBL116291
Type:
Small organic molecule
Emp. Form.:
C13H14N2O4Se
Mol. Mass.:
341.22
SMILES:
OCCOCn1c([Se]c2ccccc2)cc(=O)[nH]c1=O
: