Target
D(4) dopamine receptor
Ligand
BDBM50257034
Substrate
Meas. Tech.
ChEMBL_1688620 (CHEMBL4039190)
Ki
0.330000±n/a nM
Citation
 Lindsley, CWHopkins, CR Return of D J Med Chem 60:7233-7243 (2017)  
Target
Name:
D(4) dopamine receptor
Synonyms:
D(2C) dopamine receptor DOPAMINE D4.2 DRD4 Dopamine D4 receptor
Type:
Enzyme
Mol. Mass.:
48373.19
Organism:
Homo sapiens (Human)
Description:
P21917
Residue:
419
  
Inhibitor
Name:
BDBM50257034
Synonyms:
CHEMBL4096543
Type:
Small organic molecule
Emp. Form.:
C21H28IN3O
Mol. Mass.:
465.371
SMILES:
CC(C)Oc1cccnc1N(C)C1CCN(Cc2ccc(I)cc2)CC1
: