Target
Adenosylhomocysteinase
Ligand
BDBM50006223
Substrate
Meas. Tech.
ChEBML_196867
Ki
150±n/a nM
Citation
 Shuto, SObara, TToriya, MHosoya, MSnoeck, RAndrei, GBalzarini, JDe Clercq, E New neplanocin analogues. 1. Synthesis of 6'-modified neplanocin A derivatives as broad-spectrum antiviral agents. J Med Chem 35:324-31 (1992)  
Target
Name:
Adenosylhomocysteinase
Synonyms:
Adenosylhomocysteinase Ahcy Liver copper-binding protein SAHH_MOUSE
Type:
PROTEIN
Mol. Mass.:
47687.65
Organism:
Mus musculus
Description:
ChEMBL_196559
Residue:
432
  
Inhibitor
Name:
BDBM50006223
Synonyms:
5-(6-Amino-purin-9-yl)-3-methyl-cyclopent-3-ene-1,2-diol | CHEMBL299135
Type:
Small organic molecule
Emp. Form.:
C11H13N5O2
Mol. Mass.:
247.2532
SMILES:
CC1=C[C@H]([C@H](O)[C@@H]1O)n1cnc2c(N)ncnc12
: