Target
C5a anaphylatoxin chemotactic receptor 1
Ligand
BDBM50008374
Substrate
Meas. Tech.
ChEBML_41602
Ki
4400±n/a nM
Citation
 Or, YSClark, RFLane, BMollison, KWCarter, GWLuly, JR Improvements in the minimum binding sequence of C5a: examination of His-67. J Med Chem 35:402-6 (1992)  
Target
Name:
C5a anaphylatoxin chemotactic receptor 1
Synonyms:
C5AR C5AR1_HUMAN C5a anaphylatoxin chemotactic receptor C5a-R | CD_antigen=CD88
Type:
Enzyme
Mol. Mass.:
39347.68
Organism:
Homo sapiens (Human)
Description:
P21730
Residue:
350
  
Inhibitor
Name:
BDBM50008374
Synonyms:
CHEMBL435002 | Hca-Lys-AspMet-GIn-Leu-Gly-Arg-OH
Type:
Small organic molecule
Emp. Form.:
C43H70N12O12S
Mol. Mass.:
979.154
SMILES:
CSCC[C@H](NC(=O)[C@H](CC(O)=O)NC(=O)[C@H](CCCCN)NC(=O)CCc1ccccc1)C(=O)N[C@@H](CCC(N)=O)C(=O)N[C@@H](CC(C)C)C(=O)NCC(=O)N[C@@H](CCCNC(N)=N)C(O)=O
: