Target
Aminopeptidase B
Ligand
BDBM50008429
Substrate
Meas. Tech.
ChEBML_36049
Ki
>1000000±n/a nM
Citation
 Ocain, TDRich, DH alpha-Keto amide inhibitors of aminopeptidases. J Med Chem 35:451-6 (1992)  
Target
Name:
Aminopeptidase B
Synonyms:
AMPB_HUMAN Aminopeptidase Arginine aminopeptidase RNPEP
Type:
PROTEIN
Mol. Mass.:
72586.33
Organism:
Homo sapiens (Human)
Description:
ChEMBL_36048
Residue:
650
  
Inhibitor
Name:
BDBM50008429
Synonyms:
(3S)-3-amino-5-methylhexan-2-one CHEMBL342867
Type:
Small organic molecule
Emp. Form.:
C7H15NO
Mol. Mass.:
129.2001
SMILES:
CC(C)C[C@H](N)C(C)=O
: